Reaction Details
TargetTryptophan 2,3-dioxygenase
LigandBDBM317215
Substrate/Competitorn/a
Meas. Tech.Enzymatic TDO Assay
IC50<100±n/a nM
Citation Kumar, SWaldo, JJaipuri, FMautino, M Tricyclic compounds as inhibitors of immunosuppression mediated by tryptophan metabolization US Patent US9617272 Publication Date 4/11/2017
 
Tryptophan 2,3-dioxygenase
Name:Tryptophan 2,3-dioxygenase
Type:PROTEIN
Mol. Mass.:47874.48
Organism:Homo sapiens (Human)
Description:ChEMBL_825691
Residue:406
BDBM317215
NameBDBM317215
Synonyms:US9617272, Compound 70 | US9981973, Compound 70
TypeSmall organic molecule
Emp. Form.C18H22N2O
Mol. Mass.282.3801
SMILESOC(CC1c2cncn2-c2ccccc12)C1CCCCC1