Reaction Details
TargetTryptophan 2,3-dioxygenase
LigandBDBM317217
Substrate/Competitorn/a
Meas. Tech.Enzymatic TDO Assay
IC50 550±n/a nM
Citation Kumar, SWaldo, JJaipuri, FMautino, M Tricyclic compounds as inhibitors of immunosuppression mediated by tryptophan metabolization US Patent US9617272 Publication Date 4/11/2017
 
Tryptophan 2,3-dioxygenase
Name:Tryptophan 2,3-dioxygenase
Type:PROTEIN
Mol. Mass.:47874.48
Organism:Homo sapiens (Human)
Description:ChEMBL_825691
Residue:406
BDBM317217
NameBDBM317217
Synonyms:US9617272, Compound 101 | US9981973, Compound 101
TypeSmall organic molecule
Emp. Form.C10H8N2
Mol. Mass.156.1839
SMILESC1c2cn[nH]c2-c2ccccc12