Reaction Details
TargetPlasma kallikrein
LigandBDBM187097
Substrate/Competitorn/a
Meas. Tech.Plasma kallikrein assay
IC50 8.00±n/a nM
Citation Allan, CEBatt, ARDavie, RLEdwards, HJEvans, DMPethen, SJ Benzylamine derivatives US Patent US9670157 Publication Date 6/6/2017
 
Plasma kallikrein
Name:Plasma kallikrein
Type:Protein
Mol. Mass.:71391.16
Organism:Homo sapiens (Human)
Description:P03952
Residue:638
BDBM187097
NameBDBM187097
Synonyms:US9670157, 111 1-[4-(4-Methyl-pyrazol-1-ylmethyl)-benzyl]-1H-pyrazole-4-carboxylic acid 4-aminomethyl-2,6-dimethyl-benzylamide US9834513, 111
TypeSmall organic molecule
Emp. Form.C26H30N6O
Mol. Mass.442.556
SMILESCc1cnn(Cc2ccc(Cn3cc(cn3)C(=O)NCc3c(C)cc(CN)cc3C)cc2)c1