Reaction Details
TargetKallikrein-1
LigandBDBM187110
Substrate/Competitorn/a
Meas. Tech.KLK1 assay
IC50 301±n/a nM
Citation Allan, CEBatt, ARDavie, RLEdwards, HJEvans, DMPethen, SJ Benzylamine derivatives US Patent US9670157 Publication Date 6/6/2017
 
Kallikrein-1
Name:Kallikrein-1
Type:Enzyme
Mol. Mass.:28874.69
Organism:Homo sapiens (Human)
Description:P06870
Residue:262
BDBM187110
NameBDBM187110
Synonyms:US9670157, 124 3-Methyl-1-(2-methyl-quinolin-6-ylmethyl)-1H-pyrazole-4-carboxylic acid 4-aminomethyl-2,6-dimethyl-benzylamide | US9834513, 124
TypeSmall organic molecule
Emp. Form.C26H29N5O
Mol. Mass.427.5414
SMILESCc1nn(Cc2ccc3nc(C)ccc3c2)cc1C(=O)NCc1c(C)cc(CN)cc1C