Reaction Details
TargetEstrogen receptor beta
LigandBDBM317457
Substrate/Competitorn/a
Meas. Tech.Binding Assay
Ki 3.00±n/a nM
Citation Narayanan, RYepuru, MDalton, JT Nuclear receptor binding agents US Patent US9623021 Publication Date 4/18/2017
 
Estrogen receptor beta
Name:Estrogen receptor beta
Type:Protein
Mol. Mass.:59238.43
Organism:Homo sapiens (Human)
Description:Q92731
Residue:530
BDBM317457
NameBDBM317457
Synonyms:4-chloro-6,8-dihydroxy-2-(4-hydroxyphenyl)isoquinolin-1(2H)-one | US9623021, 12z
TypeSmall organic molecule
Emp. Form.C15H10ClNO4
Mol. Mass.303.697
SMILESOc1ccc(cc1)-n1cc(Cl)c2cc(O)cc(O)c2c1=O