Reaction Details
TargetEstrogen receptor beta
LigandBDBM312140
Substrate/Competitorn/a
Meas. Tech.Binding Assay
Ki 0.480±n/a nM
Citation Narayanan, RYepuru, MDalton, JT Nuclear receptor binding agents US Patent US9623021 Publication Date 4/18/2017
 
Estrogen receptor beta
Name:Estrogen receptor beta
Type:Protein
Mol. Mass.:59238.43
Organism:Homo sapiens (Human)
Description:Q92731
Residue:530
BDBM312140
NameBDBM312140
Synonyms:6,8-dihydroxy-2-(4-hydroxyphenyl)-4-(4-methoxyphenyl)isoquinolin-1(2H)-one US9604931, 15g | US9623021, Compound 15g
TypeSmall organic molecule
Emp. Form.C22H17NO5
Mol. Mass.375.3741
SMILESCOc1ccc(cc1)-c1cn(-c2ccc(O)cc2)c(=O)c2c(O)cc(O)cc12