Reaction Details
TargetEstrogen receptor beta
LigandBDBM312149
Substrate/Competitorn/a
Meas. Tech.Binding Assay
Ki 3.03±n/a nM
Citation Narayanan, RYepuru, MDalton, JT Nuclear receptor binding agents US Patent US9623021 Publication Date 4/18/2017
 
Estrogen receptor beta
Name:Estrogen receptor beta
Type:Protein
Mol. Mass.:59238.43
Organism:Homo sapiens (Human)
Description:Q92731
Residue:530
BDBM312149
NameBDBM312149
Synonyms:6,8-dihydroxy-2-(4-hydroxyphenyl)-4-(4-methoxyphenyl)isoquinolin-1(2H)-one US9604931, 15h | US9623021, Compound 15h
TypeSmall organic molecule
Emp. Form.C21H15NO4
Mol. Mass.345.3481
SMILESOc1ccc(cc1)-n1cc(-c2ccccc2)c2cc(O)cc(O)c2c1=O