Reaction Details
TargetCalcium/calmodulin-dependent protein kinase kinase 2
LigandBDBM317468
Substrate/Competitorn/a
Meas. Tech.Radioactivity Based Kinase Assay
IC50 501±n/a nM
Citation Zhu, DBoylan, JXu, SRiggs, JShi, TWurmser, AMikolon, DDeyanat-Yazdi, G Methods of treating a cancer using substituted pyrrolopyrimidine compounds, compositions thereof US Patent US9623028 Publication Date 4/18/2017
 
Calcium/calmodulin-dependent protein kinase kinase 2
Name:Calcium/calmodulin-dependent protein kinase kinase 2
Type:Enzyme Catalytic Domain
Mol. Mass.:64746.61
Organism:Homo sapiens (Human)
Description:gi_27437015
Residue:588
BDBM317468
NameBDBM317468
Synonyms:4-(4-(cyclopentyloxy)-5-(2- methylbenzo[d]oxazol-6-yl)-7H- pyrrolo[2,3-d]pyrimidin-2- ylamino)-N-(2-hydroxyethyl)-3- methoxybenzamide | US9623028, Compound 101
TypeSmall organic molecule
Emp. Form.C29H30N6O5
Mol. Mass.542.5857
SMILESCOc1cc(ccc1Nc1nc(OC2CCCC2)c2c(c[nH]c2n1)-c1ccc2nc(C)oc2c1)C(=O)NCCO