Reaction Details
TargetDual specificity protein kinase CLK2
LigandBDBM317469
Substrate/Competitorn/a
Meas. Tech.Radioactivity Based Kinase Assay
IC50 2.29±n/a nM
Citation Zhu, DBoylan, JXu, SRiggs, JShi, TWurmser, AMikolon, DDeyanat-Yazdi, G Methods of treating a cancer using substituted pyrrolopyrimidine compounds, compositions thereof US Patent US9623028 Publication Date 4/18/2017
 
Dual specificity protein kinase CLK2
Name:Dual specificity protein kinase CLK2
Type:n/a
Mol. Mass.:60128.79
Organism:Homo sapiens (Human)
Description:P49760
Residue:499
BDBM317469
NameBDBM317469
Synonyms:3-methoxy-4-(4-methoxy-5-(6- methoxypyridin-3-yl)-7H- pyrrolo[2,3-d]pyrimidin-2- ylamino)-N-methylbenzamide | US9623028, Compound 118
TypeSmall organic molecule
Emp. Form.C22H22N6O4
Mol. Mass.434.4479
SMILESCNC(=O)c1ccc(Nc2nc(OC)c3c(c[nH]c3n2)-c2ccc(OC)nc2)c(OC)c1