Reaction Details
TargetDual specificity protein kinase CLK2
LigandBDBM317470
Substrate/Competitorn/a
Meas. Tech.Radioactivity Based Kinase Assay
IC50 29.1±n/a nM
Citation Zhu, DBoylan, JXu, SRiggs, JShi, TWurmser, AMikolon, DDeyanat-Yazdi, G Methods of treating a cancer using substituted pyrrolopyrimidine compounds, compositions thereof US Patent US9623028 Publication Date 4/18/2017
 
Dual specificity protein kinase CLK2
Name:Dual specificity protein kinase CLK2
Type:n/a
Mol. Mass.:60128.79
Organism:Homo sapiens (Human)
Description:P49760
Residue:499
BDBM317470
NameBDBM317470
Synonyms:3-chloro-N-methyl-4-(5-(2- methylbenzo[d]oxazol-6-yl)-4- (tetrahydro-2H-pyran-4-yloxy)- 7H-pyrrolo[2,3-d]pyrimidin-2- ylamino)benzamide | US9623028, Compound 132
TypeSmall organic molecule
Emp. Form.C27H25ClN6O4
Mol. Mass.532.978
SMILESCNC(=O)c1ccc(Nc2nc(OC3CCOCC3)c3c(c[nH]c3n2)-c2ccc3nc(C)oc3c2)c(Cl)c1