Reaction Details
TargetDual specificity protein kinase CLK2
LigandBDBM317481
Substrate/Competitorn/a
Meas. Tech.Radioactivity Based Kinase Assay
IC50 5.92±n/a nM
Citation Zhu, DBoylan, JXu, SRiggs, JShi, TWurmser, AMikolon, DDeyanat-Yazdi, G Methods of treating a cancer using substituted pyrrolopyrimidine compounds, compositions thereof US Patent US9623028 Publication Date 4/18/2017
 
Dual specificity protein kinase CLK2
Name:Dual specificity protein kinase CLK2
Type:n/a
Mol. Mass.:60128.79
Organism:Homo sapiens (Human)
Description:P49760
Residue:499
BDBM317481
NameBDBM317481
Synonyms:4-(4-cyclobutoxy-5-(2- methylbenzo[d]oxazol-6-yl)-7H- pyrrolo[2,3-d]pyrimidin-2- ylamino)-3-methoxy-N-(oxetan- 3-yl)benzamide | US9623028, Compound 339
TypeSmall organic molecule
Emp. Form.C29H28N6O5
Mol. Mass.540.5698
SMILESCOc1cc(ccc1Nc1nc(OC2CCC2)c2c(c[nH]c2n1)-c1ccc2nc(C)oc2c1)C(=O)NC1COC1