Reaction Details
TargetAcetylcholinesterase
LigandBDBM10947
Substrate/CompetitorBDBM8959
Meas. Tech.Enzyme Inhibition Assay
pH7.4±n/a
Temperature310.15±n/a K
IC50 4.93±0.23 nM
Citation Feng, SWang, ZHe, XZheng, SXia, YJiang, HTang, XBai, D Bis-huperzine B: highly potent and selective acetylcholinesterase inhibitors. J Med Chem48:655-7 (2005) 
 
Acetylcholinesterase
Name:Acetylcholinesterase
Type:Enzyme
Mol. Mass.:68193.62
Organism:Rattus norvegicus (rat)
Description:P37136
Residue:614
BDBM10947
BDBM8959
NameBDBM10947
Synonyms:(1R,10R)-16-methyl-14-{3-[methyl({10-[methyl({3-[(1R,10R)-16-methyl-5-oxo-6,14-diazatetracyclo[7.5.3.0^{1,10}.0^{2,7}]heptadeca-2(7),3,16-trien-14-yl]-3-oxopropyl})amino]decyl})amino]propanoyl}-6,14-diazatetracyclo[7.5.3.0^{1,10}.0^{2,7}]heptadeca-2(7),3,16-trien-5-one bis(18)-HupB
TypeSmall organic molecule
Emp. Form.C50H72N6O4
Mol. Mass.821.1445
SMILESCN(CCCCCCCCCCN(C)CCC(=O)N1CCC[C@@H]2C3Cc4[nH]c(=O)ccc4[C@]12CC(C)=C3)CCC(=O)N1CCC[C@@H]2C3Cc4[nH]c(=O)ccc4[C@]12CC(C)=C3