Reaction Details
TargetCarboxylic ester hydrolase
LigandBDBM10942
Substrate/CompetitorBDBM8978
Meas. Tech.Enzyme Inhibition Assay
pH7.4±n/a
Temperature310.15±n/a K
IC50 60000±3000 nM
Citation Feng, SWang, ZHe, XZheng, SXia, YJiang, HTang, XBai, D Bis-huperzine B: highly potent and selective acetylcholinesterase inhibitors. J Med Chem48:655-7 (2005) 
 
Carboxylic ester hydrolase
Name:Carboxylic ester hydrolase
Type:Enzyme
Mol. Mass.:67776.22
Organism:Rattus norvegicus (rat)
Description:n/a
Residue:597
BDBM10942
BDBM8978
NameBDBM10942
Synonyms:(1R,10R)-16-methyl-14-{2-[methyl({3-[methyl({2-[(1R,10R)-16-methyl-5-oxo-6,14-diazatetracyclo[7.5.3.0^{1,10}.0^{2,7}]heptadeca-2(7),3,16-trien-14-yl]-2-oxoethyl})amino]propyl})amino]acetyl}-6,14-diazatetracyclo[7.5.3.0^{1,10}.0^{2,7}]heptadeca-2(7),3,16-trien-5-one bis(9)-Hup B
TypeSmall organic molecule
Emp. Form.C41H54N6O4
Mol. Mass.694.9053
SMILESCN(CCCN(C)CC(=O)N1CCC[C@@H]2C3Cc4[nH]c(=O)ccc4[C@]12CC(C)=C3)CC(=O)N1CCC[C@@H]2C3Cc4[nH]c(=O)ccc4[C@]12CC(C)=C3