Reaction Details
TargetCyclin-T1/Cyclin-dependent kinase 9
LigandBDBM187120
Substrate/Competitorn/a
Meas. Tech.CDK9/CycT1 High ATP Kinase Assay
pH8±n/a
IC50 2±0.0 nM
Commentsextracted
Citation Lücking, UBöhnke, NScholz, ALienau, PSiemeister, GBömer, UKosemund, DBohlmann, RZorn, L 5-fluoro-N-(pyridin-2-yl)pyridin-2-amine derivatives containing a sulfone group US Patent US9670161 Publication Date 6/6/2017
 
Cyclin-T1/Cyclin-dependent kinase 9
Name:Cyclin-T1/Cyclin-dependent kinase 9
Type:Protein Complex
Mol. Mass.:n/a
Description:n/a
Components:This complex has 2 components.
Component 1
Name:Cyclin-T1
Synonyms:CCNT1 CycT Cyclin T Cyclin-T
Type:Enzyme Subunit
Mol. Mass.:80712.40
Organism:Homo sapiens (Human)
Description:n/a
Residue:726
Component 2
Name:Cyclin-dependent kinase 9
Synonyms:C-2K CDK9 Cell division cycle 2-like protein kinase 4 Cyclin-Dependent Kinase 9 (CDK9) Serine/threonine-protein kinase PITALRE Tat-associated kinase complex catalytic subunit
Type:Enzyme Subunit
Mol. Mass.:42789.13
Organism:Homo sapiens (Human)
Description:n/a
Residue:372
BDBM187120
NameBDBM187120
Synonyms:US9670161, 1 5-Fluoro-4-(4-fluoro-2-methoxyphenyl)-N-{4-[(methylsulfonyl)methyl]pyridin-2-yl}pyridin-2-amine
TypeSmall organic molecule
Emp. Form.C19H17F2N3O3S
Mol. Mass.405.418
SMILESCOc1cc(F)ccc1-c1cc(Nc2cc(CS(C)(=O)=O)ccn2)ncc1F