Reaction Details
TargetAcetylcholinesterase
LigandBDBM10949
Substrate/CompetitorBDBM8959
Meas. Tech.Cholinesterase Inhibition Assay
pH8±n/a
Temperature310.15±n/a K
Ki 21.7±1.4 nM
IC50 44.5±6.5 nM
Citation Piazzi, LRampa, ABisi, AGobbi, SBelluti, FCavalli, ABartolini, MAndrisano, VValenti, PRecanatini, M 3-(4-[[Benzyl(methyl)amino]methyl]phenyl)-6,7-dimethoxy-2H-2-chromenone (AP2238) inhibits both acetylcholinesterase and acetylcholinesterase-induced beta-amyloid aggregation: a dual function lead for Alzheimer's disease therapy. J Med Chem46:2279-82 (2003) 
 
Acetylcholinesterase
Name:Acetylcholinesterase
Type:Enzyme
Mol. Mass.:67792.70
Organism:Homo sapiens (Human)
Description:P22303
Residue:614
BDBM10949
BDBM8959
NameBDBM10949
Synonyms:3-(4-{[Benzyl(methyl)amino]methyl}-phenyl)-6,7-dimethoxy-2H-2-chromenone AP2238 | CHEMBL75121
TypeSmall organic molecule
Emp. Form.C26H25NO4
Mol. Mass.415.481
SMILESCOc1cc2cc(-c3ccc(CN(C)Cc4ccccc4)cc3)c(=O)oc2cc1OC