Reaction Details
TargetAmine oxidase [flavin-containing] A
LigandBDBM11013
Substrate/CompetitorBDBM10990
Meas. Tech.MAO Inhibition Assay
pH7.4±n/a
Temperature311.15±n/a K
Ki 27±0.3 nM
Citation Chimenti, FMaccioni, ESecci, DBolasco, AChimenti, PGranese, ABefani, OTurini, PAlcaro, SOrtuso, FCirilli, RLa Torre, FCardia, MCDistinto, S Synthesis, molecular modeling studies, and selective inhibitory activity against monoamine oxidase of 1-thiocarbamoyl-3,5-diaryl-4,5-dihydro-(1H)- pyrazole derivatives. J Med Chem48:7113-22 (2005) 
 
Amine oxidase [flavin-containing] A
Name:Amine oxidase [flavin-containing] A
Type:PROTEIN
Mol. Mass.:59764.63
Organism:Bos taurus
Description:ChEMBL_1501477
Residue:527
BDBM11013
BDBM10990
NameBDBM11013
Synonyms:1-thiocarbamoyl-3,5-diaryl-4,5-dihydro-(1H)-pyrazole deriv. 10 | 3,5-bis(thiophen-2-yl)-4,5-dihydro-1H-pyrazole-1-carbothioamide
TypeSmall organic molecule
Emp. Form.C12H11N3S3
Mol. Mass.293.431
SMILESNC(=S)N1N=C(CC1c1cccs1)c1cccs1