Reaction Details
TargetAmine oxidase [flavin-containing] B
LigandBDBM11015
Substrate/CompetitorBDBM10990
Meas. Tech.MAO Inhibition Assay
pH7.4±n/a
Temperature311.15±n/a K
Ki 2.7±0.07 nM
Citation Chimenti, FMaccioni, ESecci, DBolasco, AChimenti, PGranese, ABefani, OTurini, PAlcaro, SOrtuso, FCirilli, RLa Torre, FCardia, MCDistinto, S Synthesis, molecular modeling studies, and selective inhibitory activity against monoamine oxidase of 1-thiocarbamoyl-3,5-diaryl-4,5-dihydro-(1H)- pyrazole derivatives. J Med Chem48:7113-22 (2005) 
 
Amine oxidase [flavin-containing] B
Name:Amine oxidase [flavin-containing] B
Type:PROTEIN
Mol. Mass.:58428.94
Organism:Bos taurus
Description:ChEMBL_1501478
Residue:520
BDBM11015
BDBM10990
NameBDBM11015
Synonyms:(+)-(R)1 1-thiocarbamoyl-3,5-diaryl-4,5-dihydro-(1H)-pyrazole deriv. 1R
TypeSmall organic molecule
Emp. Form.C17H16ClN3S
Mol. Mass.329.847
SMILESCc1ccc(cc1)C1=NN([C@H](C1)c1ccc(Cl)cc1)C(N)=S