Reaction Details
TargetAmine oxidase
LigandBDBM11018
Substrate/CompetitorBDBM11019
Meas. Tech.MAO Inhibition Assay
pH7.4±n/a
Temperature298.15±n/a K
Ki>1000000±n/a nM
Commentsno inhibition
Citation Hubalek, FBinda, CKhalil, ALi, MMattevi, ACastagnoli, NEdmondson, DE Demonstration of isoleucine 199 as a structural determinant for the selective inhibition of human monoamine oxidase B by specific reversible inhibitors. J Biol Chem280:15761-6 (2005) 
 
Amine oxidase
Name:Amine oxidase
Type:Enzyme
Mol. Mass.:50985.83
Organism:Ovis aries (sheep)
Description:Mitochondrial preparation.
Residue:451
BDBM11018
BDBM11019
NameBDBM11018
Synonyms:2-[(E)-2-(3-chlorophenyl)ethenyl]-3,5,7-trimethyl-3H,4H,5H,6H,7H-imidazo[4,5-c]pyridine-4,6-dione | 8-(3-chlorostyryl)caffeine (CSC)
TypeSmall organic molecule
Emp. Form.C17H16ClN3O2
Mol. Mass.329.781
SMILESCC1c2nc(\C=C\c3cccc(Cl)c3)n(C)c2C(=O)N(C)C1=O