Reaction Details
TargetCarbonic anhydrase 2
LigandBDBM10873
Substrate/CompetitorBDBM10856
Meas. Tech.CA Inhibition Assay
Ki 33±n/a nM
Citation Nishimori, IVullo, DInnocenti, AScozzafava, AMastrolorenzo, ASupuran, CT Carbonic anhydrase inhibitors. The mitochondrial isozyme VB as a new target for sulfonamide and sulfamate inhibitors. J Med Chem48:7860-6 (2005) 
 
Carbonic anhydrase 2
Name:Carbonic anhydrase 2
Type:Enzyme
Mol. Mass.:29250.71
Organism:Homo sapiens (Human)
Description:P00918
Residue:260
BDBM10873
BDBM10856
NameBDBM10873
Synonyms:4-[(2-aminopyrimidin-4-yl)amino]benzene-1-sulfonamide US9616064, Compound 1aa | aromatic/heteroaromatic sulfonamide 18
TypeSmall organic molecule
Emp. Form.C10H11N5O2S
Mol. Mass.265.292
SMILESNc1nccc(Nc2ccc(cc2)S(N)(=O)=O)n1