Reaction Details
TargetCarbonic anhydrase 5A, mitochondrial
LigandBDBM10879
Substrate/CompetitorBDBM10856
Meas. Tech.CA Inhibition Assay
Ki 9600±n/a nM
Citation Nishimori, IVullo, DInnocenti, AScozzafava, AMastrolorenzo, ASupuran, CT Carbonic anhydrase inhibitors. The mitochondrial isozyme VB as a new target for sulfonamide and sulfamate inhibitors. J Med Chem48:7860-6 (2005) 
 
Carbonic anhydrase 5A, mitochondrial
Name:Carbonic anhydrase 5A, mitochondrial
Type:Enzyme
Mol. Mass.:34755.54
Organism:Homo sapiens (Human)
Description:Human (cloned) isozyme
Residue:305
BDBM10879
BDBM10856
NameBDBM10879
Synonyms:2-Hydrazinobenzenesulfonamide CHEMBL176495 hydrazide deriv. 18
TypeSmall organic molecule
Emp. Form.C6H9N3O2S
Mol. Mass.187.22
SMILESNNc1ccccc1S(N)(=O)=O