Reaction Details
TargetCarbonic anhydrase 5B, mitochondrial
LigandBDBM10857
Substrate/CompetitorBDBM10856
Meas. Tech.CA Inhibition Assay
Ki 3650±n/a nM
Citation Nishimori, IVullo, DInnocenti, AScozzafava, AMastrolorenzo, ASupuran, CT Carbonic anhydrase inhibitors. The mitochondrial isozyme VB as a new target for sulfonamide and sulfamate inhibitors. J Med Chem48:7860-6 (2005) 
 
Carbonic anhydrase 5B, mitochondrial
Name:Carbonic anhydrase 5B, mitochondrial
Type:Enzyme
Mol. Mass.:36440.83
Organism:Homo sapiens (Human)
Description:Human (cloned) isozyme
Residue:317
BDBM10857
BDBM10856
NameBDBM10857
Synonyms:4-aminobenzene-1-sulfonamide Sulfanilamide aromatic/heteroaromatic sulfonamide 2 | halogenosulfanilamide deriv. 5a
TypeSmall organic molecule
Emp. Form.C6H8N2O2S
Mol. Mass.172.205
SMILESNc1ccc(cc1)S(N)(=O)=O