Reaction Details
TargetCarbonic anhydrase 5B, mitochondrial
LigandBDBM10866
Substrate/CompetitorBDBM10856
Meas. Tech.CA Inhibition Assay
Ki 6560±n/a nM
Citation Nishimori, IVullo, DInnocenti, AScozzafava, AMastrolorenzo, ASupuran, CT Carbonic anhydrase inhibitors. The mitochondrial isozyme VB as a new target for sulfonamide and sulfamate inhibitors. J Med Chem48:7860-6 (2005) 
 
Carbonic anhydrase 5B, mitochondrial
Name:Carbonic anhydrase 5B, mitochondrial
Type:Enzyme
Mol. Mass.:36440.83
Organism:Homo sapiens (Human)
Description:Human (cloned) isozyme
Residue:317
BDBM10866
BDBM10856
NameBDBM10866
Synonyms:4-amino-6-(trifluoromethyl)benzene-1,3-disulfonamide aromatic/heteroaromatic sulfonamide 11
TypeSmall organic molecule
Emp. Form.C7H8F3N3O4S2
Mol. Mass.319.281
SMILESNc1cc(c(cc1S(N)(=O)=O)S(N)(=O)=O)C(F)(F)F