Reaction Details
TargetTyrosine-protein kinase BTK
LigandBDBM317619
Substrate/Competitorn/a
Meas. Tech.Inhibition Assay
IC50 6.15±n/a nM
Citation Lopez-Tapia, FJSo, SQiao, QDominique, R Inhibitors of bruton's tyrosine kinase US Patent US9624201 Publication Date 4/18/2017
 
Tyrosine-protein kinase BTK
Name:Tyrosine-protein kinase BTK
Type:Enzyme
Mol. Mass.:76289.95
Organism:Homo sapiens (Human)
Description:Q06187
Residue:659
BDBM317619
NameBDBM317619
Synonyms:US10640491, Compound 8 US9624201, Compound 8 | {5-Amino-1- [4-(2,3- difluoro- phenoxy)-2- methyl- phenyl]-1H- pyrazol-4-yl}- (4-pyridin-2- yl-1H-indol-2- yl)-methanone
TypeSmall organic molecule
Emp. Form.C30H21F2N5O2
Mol. Mass.521.5168
SMILESCc1cc(Oc2cccc(F)c2F)ccc1-n1ncc(C(=O)c2cc3c(cccc3[nH]2)-c2ccccn2)c1N