Reaction Details
TargetNuclear receptor ROR-gamma
LigandBDBM317854
Substrate/Competitorn/a
Meas. Tech.Binding Assay
Ki<100±n/a nM
Citation Claremon, DADillard, LWDong, CFan, YJia, LLiu, ZLotesta, SDMarcus, ASingh, SBTice, CMYuan, JZhao, WZheng, YZhuang, L Dihydropyrrolopyridine inhibitors of ROR-gamma US Patent US9624217 Publication Date 4/18/2017
 
Nuclear receptor ROR-gamma
Name:Nuclear receptor ROR-gamma
Type:Enzyme Catalytic Domain
Mol. Mass.:58218.40
Organism:Homo sapiens (Human)
Description:P51449
Residue:518
BDBM317854
NameBDBM317854
Synonyms:US10399976, Compound 7 US11535614, Compound 7 | US9624217, Compound 7
TypeSmall organic molecule
Emp. Form.C27H30FN3O3S
Mol. Mass.495.609
SMILESCCS(=O)(=O)c1ccc(CNC(=O)c2cnc3[C@H](C(C)C)N(Cc4ccc(F)cc4)Cc3c2)cc1