Reaction Details
TargetNuclear receptor ROR-gamma
LigandBDBM317856
Substrate/Competitorn/a
Meas. Tech.Binding Assay
Ki<100±n/a nM
Citation Claremon, DADillard, LWDong, CFan, YJia, LLiu, ZLotesta, SDMarcus, ASingh, SBTice, CMYuan, JZhao, WZheng, YZhuang, L Dihydropyrrolopyridine inhibitors of ROR-gamma US Patent US9624217 Publication Date 4/18/2017
 
Nuclear receptor ROR-gamma
Name:Nuclear receptor ROR-gamma
Type:Enzyme Catalytic Domain
Mol. Mass.:58218.40
Organism:Homo sapiens (Human)
Description:P51449
Residue:518
BDBM317856
NameBDBM317856
Synonyms:(S)-6-(4-chlorobenzyl)-N-(4-(ethylsulfonyl)benzyl)-7-isopropyl-6,7-dihydro-5H-pyrrolo[3,4-b]pyridine-3-carboxamide US9624217, Compound 9
TypeSmall organic molecule
Emp. Form.C27H28ClN3O4S
Mol. Mass.526.047
SMILESCCS(=O)(=O)c1ccc(CNC(=O)c2cnc3[C@H](C(C)C)N(Cc4ccc(Cl)cc4)C(=O)c3c2)cc1