Reaction Details
TargetNuclear receptor ROR-gamma
LigandBDBM317871
Substrate/Competitorn/a
Meas. Tech.Binding Assay
Ki<100±n/a nM
Citation Claremon, DADillard, LWDong, CFan, YJia, LLiu, ZLotesta, SDMarcus, ASingh, SBTice, CMYuan, JZhao, WZheng, YZhuang, L Dihydropyrrolopyridine inhibitors of ROR-gamma US Patent US9624217 Publication Date 4/18/2017
 
Nuclear receptor ROR-gamma
Name:Nuclear receptor ROR-gamma
Type:Enzyme Catalytic Domain
Mol. Mass.:58218.40
Organism:Homo sapiens (Human)
Description:P51449
Residue:518
BDBM317871
NameBDBM317871
Synonyms:US10399976, Compound 24 US11535614, Compound 24 | US9624217, Compound 24
TypeSmall organic molecule
Emp. Form.C26H28FN3O3S
Mol. Mass.481.582
SMILESCC(C)[C@@H]1N(Cc2ccc(F)cc2)Cc2cc(cnc12)C(=O)NCc1ccc(cc1)S(C)(=O)=O