Reaction Details
TargetNuclear receptor ROR-gamma
LigandBDBM317889
Substrate/Competitorn/a
Meas. Tech.Binding Assay
Ki<100±n/a nM
Citation Claremon, DADillard, LWDong, CFan, YJia, LLiu, ZLotesta, SDMarcus, ASingh, SBTice, CMYuan, JZhao, WZheng, YZhuang, L Dihydropyrrolopyridine inhibitors of ROR-gamma US Patent US9624217 Publication Date 4/18/2017
 
Nuclear receptor ROR-gamma
Name:Nuclear receptor ROR-gamma
Type:Enzyme Catalytic Domain
Mol. Mass.:58218.40
Organism:Homo sapiens (Human)
Description:P51449
Residue:518
BDBM317889
NameBDBM317889
Synonyms:US10399976, Compound 42 US11535614, Compound 42 | US9624217, Compound 42
TypeSmall organic molecule
Emp. Form.C27H35F2N3O3S
Mol. Mass.519.647
SMILESCCS(=O)(=O)c1ccc(CNC(=O)c2cnc3[C@H](C(C)C)N(CC4CCC(F)(F)CC4)Cc3c2)cc1