Reaction Details
TargetNuclear receptor ROR-gamma
LigandBDBM317893
Substrate/Competitorn/a
Meas. Tech.Binding Assay
Ki<100±n/a nM
Citation Claremon, DADillard, LWDong, CFan, YJia, LLiu, ZLotesta, SDMarcus, ASingh, SBTice, CMYuan, JZhao, WZheng, YZhuang, L Dihydropyrrolopyridine inhibitors of ROR-gamma US Patent US9624217 Publication Date 4/18/2017
 
Nuclear receptor ROR-gamma
Name:Nuclear receptor ROR-gamma
Type:Enzyme Catalytic Domain
Mol. Mass.:58218.40
Organism:Homo sapiens (Human)
Description:P51449
Residue:518
BDBM317893
NameBDBM317893
Synonyms:Tert-butyl (S)-3-(((5-(ethylsulfonyl)pyridin-2-yl)methyl)carbamoyl)-7-isopropyl-5,7-dihydro-6H-pyrrolo[3,4-b]pyridine-6-carboxylate US10807980, Compound 46 US9624217, Compound 46
TypeSmall organic molecule
Emp. Form.C24H32N4O5S
Mol. Mass.488.6
SMILESCCS(=O)(=O)c1ccc(CNC(=O)c2cnc3[C@H](C(C)C)N(Cc3c2)C(=O)OC(C)(C)C)nc1