Reaction Details
TargetNuclear receptor ROR-gamma
LigandBDBM317910
Substrate/Competitorn/a
Meas. Tech.Binding Assay
Ki<100±n/a nM
Citation Claremon, DADillard, LWDong, CFan, YJia, LLiu, ZLotesta, SDMarcus, ASingh, SBTice, CMYuan, JZhao, WZheng, YZhuang, L Dihydropyrrolopyridine inhibitors of ROR-gamma US Patent US9624217 Publication Date 4/18/2017
 
Nuclear receptor ROR-gamma
Name:Nuclear receptor ROR-gamma
Type:Enzyme Catalytic Domain
Mol. Mass.:58218.40
Organism:Homo sapiens (Human)
Description:P51449
Residue:518
BDBM317910
NameBDBM317910
Synonyms:US10399976, Compound 63 US11535614, Compound 63 | US9624217, Compound 63
TypeSmall organic molecule
Emp. Form.C26H33F3N4O3S
Mol. Mass.538.625
SMILESCC(C)[C@@H]1N(Cc2ccc(cc2)C(F)(F)F)Cc2cc(cnc12)C(=O)NCC1CCN(CC1)S(C)(=O)=O