Reaction Details
TargetNuclear receptor ROR-gamma
LigandBDBM317988
Substrate/Competitorn/a
Meas. Tech.Binding Assay
Ki<100±n/a nM
Citation Claremon, DADillard, LWDong, CFan, YJia, LLiu, ZLotesta, SDMarcus, ASingh, SBTice, CMYuan, JZhao, WZheng, YZhuang, L Dihydropyrrolopyridine inhibitors of ROR-gamma US Patent US9624217 Publication Date 4/18/2017
 
Nuclear receptor ROR-gamma
Name:Nuclear receptor ROR-gamma
Type:Enzyme Catalytic Domain
Mol. Mass.:58218.40
Organism:Homo sapiens (Human)
Description:P51449
Residue:518
BDBM317988
NameBDBM317988
Synonyms:US10399976, Compound 141 US11535614, Compound 141 | US9624217, Compound 141
TypeSmall organic molecule
Emp. Form.C29H31F3N4O3S
Mol. Mass.572.642
SMILESCCS(=O)(=O)c1ccc(nc1)C1(CC1)NC(=O)c1cnc2[C@H](C(C)C)N(Cc3ccc(cc3)C(F)(F)F)Cc2c1