Reaction Details
TargetPoly [ADP-ribose] polymerase tankyrase-2
LigandBDBM318008
Substrate/Competitorn/a
Meas. Tech.Biochemical Assay
IC50 6.25±1.20 nM
Citation Chedid, MEissa, HOEngler, TAFurness, KWRank, KBWoods, TAWrobleski, AD Pyrido[2,3-d]pyrimidin-4-one compounds as tankyrase inhibitors US Patent US9624218 Publication Date 4/18/2017
 
Poly [ADP-ribose] polymerase tankyrase-2
Name:Poly [ADP-ribose] polymerase tankyrase-2
Type:Enzyme
Mol. Mass.:126937.16
Organism:Homo sapiens (Human)
Description:Q9H2K2
Residue:1166
BDBM318008
NameBDBM318008
Synonyms:2-[4-[(3-Chloro-2-pyridyl)methyl]piperazin-1-yl]-8-methyl-3,5,6,7-tetrahydropyrido[2,3-d]pyrimidin-4-one | US9624218, Example 2
TypeSmall organic molecule
Emp. Form.C18H23ClN6O
Mol. Mass.374.868
SMILESCN1CCCc2c1nc([nH]c2=O)N1CCN(Cc2ncccc2Cl)CC1