Reaction Details
TargetPoly [ADP-ribose] polymerase tankyrase-2
LigandBDBM318025
Substrate/Competitorn/a
Meas. Tech.Biochemical Assay
IC50 11.8±6.55 nM
Citation Chedid, MEissa, HOEngler, TAFurness, KWRank, KBWoods, TAWrobleski, AD Pyrido[2,3-d]pyrimidin-4-one compounds as tankyrase inhibitors US Patent US9624218 Publication Date 4/18/2017
 
Poly [ADP-ribose] polymerase tankyrase-2
Name:Poly [ADP-ribose] polymerase tankyrase-2
Type:Enzyme
Mol. Mass.:126937.16
Organism:Homo sapiens (Human)
Description:Q9H2K2
Residue:1166
BDBM318025
NameBDBM318025
Synonyms:US9624218, Example 19 | US9624218, Example 34
TypeSmall organic molecule
Emp. Form.C18H24N6O
Mol. Mass.340.4228
SMILESCN1CCCc2c1nc([nH]c2=O)N1CCN(Cc2ccccn2)CC1