Reaction Details
TargetPoly [ADP-ribose] polymerase tankyrase-2
LigandBDBM318039
Substrate/Competitorn/a
Meas. Tech.Biochemical Assay
IC50 8.41±1.99 nM
Citation Chedid, MEissa, HOEngler, TAFurness, KWRank, KBWoods, TAWrobleski, AD Pyrido[2,3-d]pyrimidin-4-one compounds as tankyrase inhibitors US Patent US9624218 Publication Date 4/18/2017
 
Poly [ADP-ribose] polymerase tankyrase-2
Name:Poly [ADP-ribose] polymerase tankyrase-2
Type:Enzyme
Mol. Mass.:126937.16
Organism:Homo sapiens (Human)
Description:Q9H2K2
Residue:1166
BDBM318039
NameBDBM318039
Synonyms:2-[[4-(8-Methyl-4-oxo-3,5,6,7-tetrahydropyrido[2,3-d]pyrimidin-2-yl)piperazin-1-yl]methyl]pyridine-3-carbonitrile | US9624218, Example 40
TypeSmall organic molecule
Emp. Form.C19H23N7O
Mol. Mass.365.4322
SMILESCN1CCCc2c1nc([nH]c2=O)N1CCN(Cc2ncccc2C#N)CC1