Reaction Details
TargetPoly [ADP-ribose] polymerase tankyrase-2
LigandBDBM318042
Substrate/Competitorn/a
Meas. Tech.Biochemical Assay
IC50 12.7±6.54 nM
Citation Chedid, MEissa, HOEngler, TAFurness, KWRank, KBWoods, TAWrobleski, AD Pyrido[2,3-d]pyrimidin-4-one compounds as tankyrase inhibitors US Patent US9624218 Publication Date 4/18/2017
 
Poly [ADP-ribose] polymerase tankyrase-2
Name:Poly [ADP-ribose] polymerase tankyrase-2
Type:Enzyme
Mol. Mass.:126937.16
Organism:Homo sapiens (Human)
Description:Q9H2K2
Residue:1166
BDBM318042
NameBDBM318042
Synonyms:2-[4-[(3-Chloropyrazin-2- yl)methyl]piperazin-l-yl]-8- methyl-3,5,6,7- tetrahydropyrido[2,3- d]pyrimidin-4-one | US9624218, Example 43
TypeSmall organic molecule
Emp. Form.C17H22ClN7O
Mol. Mass.375.856
SMILESCN1CCCc2c1nc([nH]c2=O)N1CCN(Cc2nccnc2Cl)CC1