Reaction Details
TargetCarbonic anhydrase 9
LigandBDBM11049
Substrate/CompetitorBDBM10856
Meas. Tech.CA Inhibition Assay
Ki 3.6±n/a nM
Citation De Simone, GVitale, RMDi Fiore, APedone, CScozzafava, AMontero, JLWinum, JYSupuran, CT Carbonic anhydrase inhibitors: Hypoxia-activatable sulfonamides incorporating disulfide bonds that target the tumor-associated isoform IX. J Med Chem49:5544-51 (2006) 
 
Carbonic anhydrase 9
Name:Carbonic anhydrase 9
Type:Enzyme
Mol. Mass.:49669.03
Organism:Homo sapiens (Human)
Description:Catalytic domain of human cloned isozyme was used in the assay
Residue:459
BDBM11049
BDBM10856
NameBDBM11049
Synonyms:N-(5-sulfamoyl-1,3,4-thiadiazol-2-yl)-3-sulfanylpropanamide reduced thio H3
TypeSmall organic molecule
Emp. Form.C5H8N4O3S3
Mol. Mass.268.337
SMILESNS(=O)(=O)c1nnc(NC(=O)CCS)s1