Reaction Details
TargetCarbonic anhydrase 9
LigandBDBM11050
Substrate/CompetitorBDBM10856
Meas. Tech.CA Inhibition Assay
Ki 9.3±n/a nM
Citation De Simone, GVitale, RMDi Fiore, APedone, CScozzafava, AMontero, JLWinum, JYSupuran, CT Carbonic anhydrase inhibitors: Hypoxia-activatable sulfonamides incorporating disulfide bonds that target the tumor-associated isoform IX. J Med Chem49:5544-51 (2006) 
 
Carbonic anhydrase 9
Name:Carbonic anhydrase 9
Type:Enzyme
Mol. Mass.:49669.03
Organism:Homo sapiens (Human)
Description:Catalytic domain of human cloned isozyme was used in the assay
Residue:459
BDBM11050
BDBM10856
NameBDBM11050
Synonyms:N-[(2E)-3-methyl-5-sulfamoyl-2,3-dihydro-1,3,4-thiadiazol-2-ylidene]-3-[(2-{[(2E)-3-methyl-5-sulfamoyl-2,3-dihydro-1,3,4-thiadiazol-2-ylidene]carbamoyl}ethyl)disulfanyl]propanamide disulfide-containing sulfonamide 4
TypeSmall organic molecule
Emp. Form.C12H18N8O6S6
Mol. Mass.562.711
SMILESCn1nc(sc1=NC(=O)CCSSCCC(=O)N=c1sc(nn1C)S(N)(=O)=O)S(N)(=O)=O