Reaction Details
TargetCarbonic anhydrase 9
LigandBDBM11051
Substrate/CompetitorBDBM10856
Meas. Tech.CA Inhibition Assay
Ki 3.2±n/a nM
Citation De Simone, GVitale, RMDi Fiore, APedone, CScozzafava, AMontero, JLWinum, JYSupuran, CT Carbonic anhydrase inhibitors: Hypoxia-activatable sulfonamides incorporating disulfide bonds that target the tumor-associated isoform IX. J Med Chem49:5544-51 (2006) 
 
Carbonic anhydrase 9
Name:Carbonic anhydrase 9
Type:Enzyme
Mol. Mass.:49669.03
Organism:Homo sapiens (Human)
Description:Catalytic domain of human cloned isozyme was used in the assay
Residue:459
BDBM11051
BDBM10856
NameBDBM11051
Synonyms:N-[(2E)-3-methyl-5-sulfamoyl-2,3-dihydro-1,3,4-thiadiazol-2-ylidene]-3-sulfanylpropanamide rreduced monomeric thio of compound 4
TypeSmall organic molecule
Emp. Form.C6H10N4O3S3
Mol. Mass.282.364
SMILESCn1nc(sc1=NC(=O)CCS)S(N)(=O)=O