Reaction Details
TargetCarbonic anhydrase 9
LigandBDBM11055
Substrate/CompetitorBDBM10856
Meas. Tech.CA Inhibition Assay
Ki 9.0±n/a nM
Citation De Simone, GVitale, RMDi Fiore, APedone, CScozzafava, AMontero, JLWinum, JYSupuran, CT Carbonic anhydrase inhibitors: Hypoxia-activatable sulfonamides incorporating disulfide bonds that target the tumor-associated isoform IX. J Med Chem49:5544-51 (2006) 
 
Carbonic anhydrase 9
Name:Carbonic anhydrase 9
Type:Enzyme
Mol. Mass.:49669.03
Organism:Homo sapiens (Human)
Description:Catalytic domain of human cloned isozyme was used in the assay
Residue:459
BDBM11055
BDBM10856
NameBDBM11055
Synonyms:CHEMBL214745 reduced monomeric thio of 5b | reduced thio H5b
TypeSmall organic molecule
Emp. Form.C15H16N2O3S2
Mol. Mass.336.429
SMILESNS(=O)(=O)c1ccc(CCNC(=O)c2ccccc2S)cc1