Reaction Details
TargetDipeptidyl peptidase 4
LigandBDBM11071
Substrate/CompetitorBDBM11057
Meas. Tech.DPPIV Inhibition Assay
pH7.5±n/a
Temperature295.15±n/a K
Ki 6.7±n/a nM
Citation Pei, ZLi, XLongenecker, Kvon Geldern, TWWiedeman, PELubben, THZinker, BAStewart, KBallaron, SJStashko, MAMika, AKBeno, DWLong, MWells, HKempf-Grote, AJMadar, DJMcDermott, TSBhagavatula, LFickes, MGPireh, DSolomon, LRLake, MREdalji, RFry, EHSham, HLTrevillyan, JM Discovery, structure-activity relationship, and pharmacological evaluation of (5-substituted-pyrrolidinyl-2-carbonyl)-2-cyanopyrrolidines as potent dipeptidyl peptidase IV inhibitors. J Med Chem49:3520-35 (2006) 
 
Dipeptidyl peptidase 4
Name:Dipeptidyl peptidase 4
Type:Enzyme
Mol. Mass.:88271.01
Organism:Homo sapiens (Human)
Description:P27487
Residue:766
BDBM11071
BDBM11057
NameBDBM11071
Synonyms:2-cyanopyrrolidine 24b | methyl 4-[({[(2R,5S)-5-{[(2S)-2-cyanopyrrolidin-1-yl]carbonyl}pyrrolidin-2-yl]methyl}carbamoyl)amino]benzoate
TypeSmall organic molecule
Emp. Form.C20H25N5O4
Mol. Mass.399.4436
SMILESCOC(=O)c1ccc(NC(=O)NC[C@H]2CC[C@H](N2)C(=O)N2CCC[C@H]2C#N)cc1