Reaction Details
TargetDipeptidyl peptidase 4
LigandBDBM11090
Substrate/CompetitorBDBM11057
Meas. Tech.DPPIV Inhibition Assay
Ki 0.72±n/a nM
Citation Pei, ZLi, XLongenecker, Kvon Geldern, TWWiedeman, PELubben, THZinker, BAStewart, KBallaron, SJStashko, MAMika, AKBeno, DWLong, MWells, HKempf-Grote, AJMadar, DJMcDermott, TSBhagavatula, LFickes, MGPireh, DSolomon, LRLake, MREdalji, RFry, EHSham, HLTrevillyan, JM Discovery, structure-activity relationship, and pharmacological evaluation of (5-substituted-pyrrolidinyl-2-carbonyl)-2-cyanopyrrolidines as potent dipeptidyl peptidase IV inhibitors. J Med Chem49:3520-35 (2006) 
 
Dipeptidyl peptidase 4
Name:Dipeptidyl peptidase 4
Type:Enzyme
Mol. Mass.:88271.01
Organism:Homo sapiens (Human)
Description:P27487
Residue:766
BDBM11090
BDBM11057
NameBDBM11090
Synonyms:(2S)-1-{[(2S,5R)-5-{[(2-chloropyridin-3-yl)oxy]methyl}pyrrolidin-2-yl]carbonyl}pyrrolidine-2-carbonitrile | 2-cyanopyrrolidine 21n
TypeSmall organic molecule
Emp. Form.C16H19ClN4O2
Mol. Mass.334.801
SMILESClc1ncccc1OC[C@H]1CC[C@H](N1)C(=O)N1CCC[C@H]1C#N