Reaction Details
TargetDipeptidyl peptidase 4
LigandBDBM11091
Substrate/CompetitorBDBM11057
Meas. Tech.DPPIV Inhibition Assay
Ki 2.7±n/a nM
Citation Pei, ZLi, XLongenecker, Kvon Geldern, TWWiedeman, PELubben, THZinker, BAStewart, KBallaron, SJStashko, MAMika, AKBeno, DWLong, MWells, HKempf-Grote, AJMadar, DJMcDermott, TSBhagavatula, LFickes, MGPireh, DSolomon, LRLake, MREdalji, RFry, EHSham, HLTrevillyan, JM Discovery, structure-activity relationship, and pharmacological evaluation of (5-substituted-pyrrolidinyl-2-carbonyl)-2-cyanopyrrolidines as potent dipeptidyl peptidase IV inhibitors. J Med Chem49:3520-35 (2006) 
 
Dipeptidyl peptidase 4
Name:Dipeptidyl peptidase 4
Type:Enzyme
Mol. Mass.:88271.01
Organism:Homo sapiens (Human)
Description:P27487
Residue:766
BDBM11091
BDBM11057
NameBDBM11091
Synonyms:(2S)-1-{[(2S,5R)-5-[(2H-1,3-benzodioxol-5-yloxy)methyl]pyrrolidin-2-yl]carbonyl}pyrrolidine-2-carbonitrile | 2-cyanopyrrolidine 21o
TypeSmall organic molecule
Emp. Form.C18H21N3O4
Mol. Mass.343.377
SMILESO=C([C@@H]1CC[C@H](COc2ccc3OCOc3c2)N1)N1CCC[C@H]1C#N