Reaction Details
TargetDipeptidyl peptidase 4
LigandBDBM11094
Substrate/CompetitorBDBM11057
Meas. Tech.DPPIV Inhibition Assay
Ki 8.9±n/a nM
Citation Pei, ZLi, XLongenecker, Kvon Geldern, TWWiedeman, PELubben, THZinker, BAStewart, KBallaron, SJStashko, MAMika, AKBeno, DWLong, MWells, HKempf-Grote, AJMadar, DJMcDermott, TSBhagavatula, LFickes, MGPireh, DSolomon, LRLake, MREdalji, RFry, EHSham, HLTrevillyan, JM Discovery, structure-activity relationship, and pharmacological evaluation of (5-substituted-pyrrolidinyl-2-carbonyl)-2-cyanopyrrolidines as potent dipeptidyl peptidase IV inhibitors. J Med Chem49:3520-35 (2006) 
 
Dipeptidyl peptidase 4
Name:Dipeptidyl peptidase 4
Type:Enzyme
Mol. Mass.:88271.01
Organism:Homo sapiens (Human)
Description:P27487
Residue:766
BDBM11094
BDBM11057
NameBDBM11094
Synonyms:(2S)-1-{[(2S,5R)-5-(2-tert-butylphenoxymethyl)pyrrolidin-2-yl]carbonyl}pyrrolidine-2-carbonitrile | 2-cyanopyrrolidine 21aa
TypeSmall organic molecule
Emp. Form.C21H29N3O2
Mol. Mass.355.4739
SMILESCC(C)(C)c1ccccc1OC[C@H]1CC[C@H](N1)C(=O)N1CCC[C@H]1C#N