Reaction Details
TargetDipeptidyl peptidase 4
LigandBDBM11102
Substrate/CompetitorBDBM11057
Meas. Tech.DPPIV Inhibition Assay
Ki 1.0±n/a nM
Citation Pei, ZLi, XLongenecker, Kvon Geldern, TWWiedeman, PELubben, THZinker, BAStewart, KBallaron, SJStashko, MAMika, AKBeno, DWLong, MWells, HKempf-Grote, AJMadar, DJMcDermott, TSBhagavatula, LFickes, MGPireh, DSolomon, LRLake, MREdalji, RFry, EHSham, HLTrevillyan, JM Discovery, structure-activity relationship, and pharmacological evaluation of (5-substituted-pyrrolidinyl-2-carbonyl)-2-cyanopyrrolidines as potent dipeptidyl peptidase IV inhibitors. J Med Chem49:3520-35 (2006) 
 
Dipeptidyl peptidase 4
Name:Dipeptidyl peptidase 4
Type:Enzyme
Mol. Mass.:88271.01
Organism:Homo sapiens (Human)
Description:P27487
Residue:766
BDBM11102
BDBM11057
NameBDBM11102
Synonyms:2-cyanopyrrolidine 21ai | 4-bromo-3-{[(2R,5S)-5-{[(2S)-2-cyanopyrrolidin-1-yl]carbonyl}pyrrolidin-2-yl]methoxy}benzoic acid
TypeSmall organic molecule
Emp. Form.C18H20BrN3O4
Mol. Mass.422.273
SMILESOC(=O)c1ccc(Br)c(OC[C@H]2CC[C@H](N2)C(=O)N2CCC[C@H]2C#N)c1