Reaction Details
TargetBromodomain-containing protein 4
LigandBDBM318841
Substrate/Competitorn/a
Meas. Tech.In-Vitro Binding Assay
IC50<11.0±n/a nM
Citation Blank, JBold, GCotesta, SGuagnano, VRueeger, H Pyrazolo-pyrrolidin-4-one derivatives as bet inhibitors and their use in the treatment of disease US Patent US9624247 Publication Date 4/18/2017
 
Bromodomain-containing protein 4
Name:Bromodomain-containing protein 4
Type:Protein
Mol. Mass.:152264.84
Organism:Homo sapiens (Human)
Description:O60885
Residue:1362
BDBM318841
NameBDBM318841
Synonyms:6-(4-chlorophenyl)-3-cyclopropyl-5-(3-(difluoromethyl)-8-methyl-[1,2,4]triazolo[4,3-a]pyridin-6-yl)-1-methyl-5,6-dihydropyrrolo[3,4-c]pyrazol-4(1H)-one | US9624247, Example 3
TypeSmall organic molecule
Emp. Form.C23H19ClF2N6O
Mol. Mass.468.886
SMILESCc1cc(cn2c(nnc12)C(F)F)N1C(c2c(C1=O)c(nn2C)C1CC1)c1ccc(Cl)cc1