Reaction Details
TargetDipeptidyl peptidase 4
LigandBDBM11127
Substrate/CompetitorBDBM11114
Meas. Tech.DPPIV Inhibition Assay
pH7.4±n/a
Temperature298.15±n/a K
Ki>12800±n/a nM
Km73000±n/a nM
Citation Qiao, LBaumann, CACrysler, CSNinan, NSAbad, MCSpurlino, JCDesjarlais, RLKervinen, JNeeper, MPBayoumy, SSWilliams, RDeckman, ICDasgupta, MReed, RLHuebert, NDTomczuk, BEMoriarty, KJ Discovery, SAR, and X-ray structure of novel biaryl-based dipeptidyl peptidase IV inhibitors. Bioorg Med Chem Lett16:123-8 (2006) 
 
Dipeptidyl peptidase 4
Name:Dipeptidyl peptidase 4
Type:Enzyme
Mol. Mass.:88271.01
Organism:Homo sapiens (Human)
Description:P27487
Residue:766
BDBM11127
BDBM11114
NameBDBM11127
Synonyms:(2S)-2-amino-1-[(2S)-2-(hydroxymethyl)pyrrolidin-1-yl]-3-(4-phenylphenyl)propan-1-one | 4-phenylphenylalaninyl proline mimetic 14
TypeSmall organic molecule
Emp. Form.C20H24N2O2
Mol. Mass.324.4168
SMILESN[C@@H](Cc1ccc(cc1)-c1ccccc1)C(=O)N1CCC[C@H]1CO