Reaction Details
TargetDipeptidyl peptidase 4
LigandBDBM11155
Substrate/CompetitorBDBM11057
Meas. Tech.Dipeptidyl Peptidase Inhibition Assay
pH7.5±n/a
Temperature310.15±n/a K
IC50 7.5±n/a nM
Citation Edmondson, SDMastracchio, AMathvink, RJHe, JHarper, BPark, YJBeconi, MDi Salvo, JEiermann, GJHe, HLeiting, BLeone, JFLevorse, DALyons, KPatel, RAPatel, SBPetrov, AScapin, GShang, JRoy, RSSmith, AWu, JKXu, SZhu, BThornberry, NAWeber, AE (2S,3S)-3-Amino-4-(3,3-difluoropyrrolidin-1-yl)-N,N-dimethyl-4-oxo-2-(4-[1,2,4]triazolo[1,5-a]-pyridin-6-ylphenyl)butanamide: a selective alpha-amino amide dipeptidyl peptidase IV inhibitor for the treatment of type 2 diabetes. J Med Chem49:3614-27 (2006) 
 
Dipeptidyl peptidase 4
Name:Dipeptidyl peptidase 4
Type:Enzyme
Mol. Mass.:88271.01
Organism:Homo sapiens (Human)
Description:P27487
Residue:766
BDBM11155
BDBM11057
NameBDBM11155
Synonyms:(2S,3S)-1-(3,3-difluoropyrrolidin-1-yl)-3-(dimethylcarbamoyl)-1-oxo-3-(4-{pyrazolo[1,5-a]pyrimidin-5-yl}phenyl)propan-2-aminium; 2,2,2-trifluoroacetate Biarylphenylalanine Difluoropyrrolidide 33
TypeSmall organic molecule
Emp. Form.C22H25F2N6O2
Mol. Mass.443.4692
SMILESCN(C)C(=O)[C@H]([C@H]([NH3+])C(=O)N1CCC(F)(F)C1)c1ccc(cc1)-c1ccn2nccc2n1