Reaction Details
TargetNADPH oxidase 4
LigandBDBM318936
Substrate/Competitorn/a
Meas. Tech.Nox4 Assay
IC50 1680±n/a nM
Citation Wikström, PWalum, EWilcke, M N2-(3,4-dimethylphenyl)-6-((4-(p-tolyl)piperazin-1-yl)methyl)-1,3,5-triazine-2,4-diamine US Patent US10173988 Publication Date 1/8/2019
 
NADPH oxidase 4
Name:NADPH oxidase 4
Type:PROTEIN
Mol. Mass.:66954.54
Organism:Homo sapiens (Human)
Description:ChEMBL_792879
Residue:578
BDBM318936
NameBDBM318936
Synonyms:US10173988, Compound A
TypeSmall organic molecule
Emp. Form.C23H29N7O
Mol. Mass.419.5227
SMILESCOc1cccc(c1)N1CCN(Cc2nc(N)nc(Nc3ccc(C)c(C)c3)n2)CC1