Reaction Details
TargetCytochrome b-245 heavy chain
LigandBDBM318940
Substrate/Competitorn/a
Meas. Tech.Nox2 Assay
IC50 16000±n/a nM
Citation Wikström, PWalum, EWilcke, M N2-(3,4-dimethylphenyl)-6-((4-(p-tolyl)piperazin-1-yl)methyl)-1,3,5-triazine-2,4-diamine US Patent US10173988 Publication Date 1/8/2019
 
Cytochrome b-245 heavy chain
Name:Cytochrome b-245 heavy chain
Type:Enzyme
Mol. Mass.:65355.82
Organism:Homo sapiens (Human)
Description:P04839
Residue:570
BDBM318940
NameBDBM318940
Synonyms:US10173988, Compound inventive
TypeSmall organic molecule
Emp. Form.C23H29N7
Mol. Mass.403.5233
SMILESCc1ccc(cc1)N1CCN(Cc2nc(N)nc(Nc3ccc(C)c(C)c3)n2)CC1