Reaction Details
TargetSolute carrier family 22 member 12
LigandBDBM318941
Substrate/Competitorn/a
Meas. Tech.HEK-URAT1 assay
IC50 2060±n/a nM
Citation Endo, TKobayashi, KTanaka, HSaito, DHirano, MEndou, HAnzai, N URAT1 inhibitor US Patent US10173990 Publication Date 1/8/2019
 
Solute carrier family 22 member 12
Name:Solute carrier family 22 member 12
Type:Enzyme
Mol. Mass.:59638.65
Organism:Homo sapiens (Human)
Description:Q96S37
Residue:553
BDBM318941
NameBDBM318941
Synonyms:2-[(4′-Cyano-(1,1′-binaphthalene)-2-yl]oxy]-2-methylpropanoic acid | US10173990, Example 2
TypeSmall organic molecule
Emp. Form.C25H19NO3
Mol. Mass.381.4233
SMILESCC(C)(Oc1ccc2ccccc2c1-c1ccc(C#N)c2ccccc12)C(O)=O