Reaction Details
TargetSolute carrier family 22 member 12
LigandBDBM318944
Substrate/Competitorn/a
Meas. Tech.HEK-URAT1 assay
IC50 170±n/a nM
Citation Endo, TKobayashi, KTanaka, HSaito, DHirano, MEndou, HAnzai, N URAT1 inhibitor US Patent US10173990 Publication Date 1/8/2019
 
Solute carrier family 22 member 12
Name:Solute carrier family 22 member 12
Type:Enzyme
Mol. Mass.:59638.65
Organism:Homo sapiens (Human)
Description:Q96S37
Residue:553
BDBM318944
NameBDBM318944
Synonyms:2-[[7-(4-Cyanophenyl)benzo[d]thiazol-6-yl]thio]-2-methylpropanoic acid | US10173990, Example 24
TypeSmall organic molecule
Emp. Form.C18H14N2O2S2
Mol. Mass.354.446
SMILESCC(C)(Sc1ccc2ncsc2c1-c1ccc(cc1)C#N)C(O)=O